「腾达签名」 - 解决苹果app/ipa/tf/ios企业超级签名下载掉签难题「腾达签名」

专注IOS苹果签名内测
解决APP签名下载难题

解决apc.c:419: error: 'apc_regex' has no member named 'preg'

解决apc.c:419: error: 'apc_regex' has no member named 'preg'-「腾达签名」

出现以下错误:

In file included from /usr/local/src/APC-3.1.5/apc.c:38:
/usr/include/php/ext/pcre/php_pcre.h:29:18: error: pcre.h: No such file or directory
In file included from /usr/local/src/APC-3.1.5/apc.c:38:
… …
/usr/local/src/APC-3.1.5/apc.c: In function 'apc_regex_compile_array':
/usr/local/src/APC-3.1.5/apc.c:419: error: 'apc_regex' has no member named 'preg'
/usr/local/src/APC-3.1.5/apc.c:419: error: 'apc_regex' has no member named 'preg'
/usr/local/src/APC-3.1.5/apc.c:420: error: 'apc_regex' has no member named 'nreg'
/usr/local/src/APC-3.1.5/apc.c:420: error: 'apc_regex' has no member named 'nreg'
/usr/local/src/APC-3.1.5/apc.c: In function 'apc_regex_match_array':
/usr/local/src/APC-3.1.5/apc.c:452: error: 'apc_regex' has no member named 'preg'
/usr/local/src/APC-3.1.5/apc.c:452: error: 'apc_regex' has no member named 'preg'
/usr/local/src/APC-3.1.5/apc.c:453: error: 'apc_regex' has no member named 'nreg'
/usr/local/src/APC-3.1.5/apc.c:453: error: 'apc_regex' has no member named 'nreg'
make: *** [apc.lo] Error 1

安装 pcre-devel 就可以解决:

yum install pcre-devel

苹果签名www.nanti.net

企业签名www.nanti.net

超级签名www.nanti.net

TF签名www.nanti.net

解决apc.c:419: error: 'apc_regex' has no member named 'preg'-「腾达签名」
本原创文章未经允许不得转载 | 当前页面:「腾达签名」 » 解决apc.c:419: error: 'apc_regex' has no member named 'preg'

评论